{"text_format":"1","workbook":"xlsx","n_sheets":6,"sheets":["INSTRUCCIONES","DATOS","EVALUACION","INFO CENTRO","PLAN DE MEDIDAS","BASE_EVAL"],"not_rendered":{"charts":0,"images":1,"macros":1,"external_links":0,"defined_names":5,"comments":0,"pivot_tables":0},"unopened":[],"bounds":{"document_bytes":16777216,"sheet_cells":100000,"rows_first":2000,"rows_last":500,"rows_between":2000,"halvings":0,"cell_chars":16384,"cell_head_chars":4096},"cells_cut":0,"cells_raw":0,"read":"whole","date_system":"1900"}

{"sheet":"INSTRUCCIONES","index":0,"n_rows":35,"n_cols":18,"rows_kept":35,"cut":false,"hidden":false,"merged":[[34,1,35,17],[0,1,4,17],[19,1,19,10],[9,1,17,17],[21,1,22,17],[24,1,25,17],[27,1,29,17],[31,1,32,17]]}
[null,"    INSTRUCTIVO DE USO"]
[]
[]
[]
[]
[]
[]
[]
[null,null,null,null,null,null,null,null,null,null,null,null,null,null,null,null,null,"Fecha de actualización del documento: 10 de mayo de 2021"]
[null,"SOBRE LA LISTA DE VERIFICACIÓN:\n\nLa siguiente lista de verificación de medidas preventivas ha sido construida a partir de lo establecido en:\n\n(a) Actualización de la Estrategia Gradual “Paso a Paso nos Cuidamos”, año 2021.\n(b) Resolución Exenta N°43 de 15 de enero de 2021 del Ministerio de Salud: Dispone medidas sanitarias que indica por brote de COVID-19 y establece nuevo plan “Paso a Paso”.\n(c) Protocolo Nacional “Modo COVID de Vida”. Medidas básicas para la población general y el funcionamiento de actividades.\n(d) Protocolo de Limpieza y Desinfección de Ambientes COVID-19.\n(e) Protocolo para la prevención y manejo del COVID-19 en centros residenciales para personas mayores. Versión 2 del 07 de octubre de 2020. MINSAL, SENAMA, SOC. DE GERIATRÍA Y GERONTOLOGÍA DE CHILE."]
[]
[]
[]
[]
[]
[]
[]
[]
[]
[null,"Pasos a seguir"]
{"$rows_left_out":16}
{"sheet":"DATOS","index":1,"n_rows":31,"n_cols":15,"rows_kept":31,"cut":false,"hidden":false,"merged":[[20,14,20,15],[20,16,20,17],[22,16,22,17],[28,16,28,17],[30,11,30,12],[28,14,28,15],[30,14,30,15],[22,14,22,15],[22,11,22,12],[30,16,30,17],[20,8,20,12],[28,11,28,12],[14,3,14,7],[28,3,28,7],[22,3,22,7],[22,9,22,10],[28,9,28,10],[2,1,5,18],[0,1,1,18],[30,9,30,10],[14,14,14,15],[14,11,14,12],[14,16,14,17],[11,1,11,10],[14,1,14,2],[28,1,28,2],[17,1,17,10],[20,1,20,2],[22,1,22,2],[25,1,25,10],[20,3,20,4],[20,6,20,7],[14,9,14,10]]}
[null,"LISTA DE VERIFICACIÓN - SERIE COVID-19"]
[]
[null,"MEDIDAS PREVENTIVAS FRENTE AL COVID-19\nESTABLECIMIENTOS DE LARGA ESTADÍA PARA ADULTOS MAYORES (ELEAM)"]
[]
[]
[]
[]
[]
[]
[null,"INFORMACIÓN DEL CENTRO DE TRABAJO EVALUADO"]
[]
[null,"Entidad empleadora"]
[]
[]
[null,"RAZÓN SOCIAL",null,null,null,null,null,null,null,"RUT",null,null,null,null,"CIIU PRINCIPAL"]
[]
[]
[null,"Dirección del centro"]
[]
[]
{"$rows_left_out":12}
{"sheet":"EVALUACION","index":2,"n_rows":74,"n_cols":5,"rows_kept":74,"cut":false,"hidden":false,"merged":[[0,1,1,7],[2,1,5,7]]}
[null,"LISTA DE VERIFICACIÓN - SERIE COVID-19"]
[]
[null,"MEDIDAS PREVENTIVAS FRENTE AL COVID-19\nESTABLECIMIENTOS DE LARGA ESTADÍA PARA ADULTOS MAYORES (ELEAM)"]
[]
[]
[]
[]
[]
[]
[]
[null,"N°","TIPO","PREGUNTA DE EVALUACIÓN (MEDIDA SEÑALADA POR LA AUTORIDAD)","EVALUACIÓN"]
[]
[null,"1.- MEDIDAS DE GESTIÓN Y ORGANIZACIÓN QUE DEBEN SER ADOPATADAS POR LA DIRECCIÓN TÉCNICA"]
[]
[null,"1.1","Obligatorio","¿Se ha designado a un profesional responsable de coordinar la planificación de medidas de prevención para COVID-19?"]
[null,"1.2","Obligatorio","¿Se cuenta con un plan de de contingencias acorde a las especificaciones establecidas en la Guía práctica de manejo COVID-19 en Establecimientos de Larga Estadía para Adultos Mayores (ELEAM), abril 2020?"]
[null,"1.3","Obligatorio","¿Se cumple con establecer la máxima coordinación con los establecimientos de salud locales, a efectos de asegurar la atención de los residentes por parte del equipo de salud, según corresponda?"]
[null,"1.4","Obligatorio","¿Se cumple con mantener el número de contacto de los miembros del equipo de salud locales?"]
[null,"1.5","Obligatorio","¿Se cumple con coordinar con los servicios de atención primaria para promover que la vacunación contra la influenza se realice dentro del establecimiento?."]
[null,"1.6","Obligatorio","¿Se ha definido una persona responsable de comunicación con el personal, residentes y familiares, respecto al estatus e impacto del COVID-19 en el establecimiento?"]
{"$rows_left_out":55}
{"sheet":"INFO CENTRO","index":3,"n_rows":26,"n_cols":16,"rows_kept":26,"cut":false,"hidden":false,"merged":[[23,2,23,4],[23,6,23,8],[25,2,25,4],[25,6,25,8],[21,3,21,8],[21,1,21,2],[14,15,14,17],[16,15,16,17],[0,1,1,18],[2,1,5,18],[12,1,12,2],[14,1,14,2],[16,1,16,2],[12,12,12,17],[14,3,14,8],[16,3,16,8],[14,11,14,13],[12,10,12,11],[12,3,12,8],[16,11,16,13]]}
[null,"LISTA DE VERIFICACIÓN - SERIE COVID-19"]
[]
[null,"MEDIDAS PREVENTIVAS FRENTE AL COVID-19\nESTABLECIMIENTOS DE LARGA ESTADÍA PARA ADULTOS MAYORES (ELEAM)"]
[]
[]
[]
[]
[null,"INFORMACIÓN DEL CENTRO DE TRABAJO EVALUADO"]
[]
[null,"Entidad empleadora",null,null,null,null,null,null,null,null,"Dirección del centro"]
[]
[]
[null,"RAZÓN SOCIAL",null,{"$f":"+IF(DATOS!D15=\"\",\"SIN INFORMACIÓN\",DATOS!D15)","v":"SIN INFORMACIÓN"},null,null,null,null,null,null,"DIRECCIÓN",null,{"$f":"+IF(DATOS!I21=\"\",\"SIN INFORMACIÓN\",DATOS!I21)","v":"SIN INFORMACIÓN"}]
[]
[null,"RUT",null,{"$f":"+IF(DATOS!L15=\"\",\"SIN INFORMACIÓN\",DATOS!L15)","v":"SIN INFORMACIÓN"},null,null,null,null,null,null,"NÚMERO",{"$f":"+IF(DATOS!Q21=\"\",\"SIN INFORMACIÓN\",DATOS!Q21)","v":"SIN INFORMACIÓN"},null,null,"LOCALIDAD",{"$f":"+IF(DATOS!D23=\"\",\"SIN INFORMACIÓN\",DATOS!D23)","v":"SIN INFORMACIÓN"}]
[]
[null,"CIIU PRINCIPAL",null,{"$f":"+IF(DATOS!Q15=\"\",\"SIN INFORMACIÓN\",DATOS!Q15)","v":"SIN INFORMACIÓN"},null,null,null,null,null,null,"COMUNA",{"$f":"+IF(DATOS!L23=\"\",\"SIN INFORMACIÓN\",DATOS!L23)","v":"SIN INFORMACIÓN"},null,null,"REGIÓN",{"$f":"+IF(DATOS!Q23=\"\",\"SIN INFORMACIÓN\",DATOS!Q23)","v":"SIN INFORMACIÓN"}]
[]
[null,"Responsable de aplicación"]
[]
{"$rows_left_out":7}
{"sheet":"PLAN DE MEDIDAS","index":4,"n_rows":75,"n_cols":8,"rows_kept":75,"cut":false,"hidden":false,"merged":[[2,1,5,6],[0,1,1,6],[7,1,8,6],[6,1,6,6]]}
[null,"LISTA DE VERIFICACIÓN - SERIE COVID-19"]
[]
[null,"PLAN DE MEDIDAS PREVENTIVAS FRENTE AL COVID-19\nESTABLECIMIENTOS DE LARGA ESTADÍA PARA ADULTOS MAYORES (ELEAM)"]
[]
[]
[]
[]
[null,"SOBRE EL PLAN DE MEDIDAS:\nPara las siguientes actividades se debe establecer RESPONSABLE y FECHA DE IMPLEMENTACIÓN, generando los registros de evidencias solicitados. Considerar que los puntos que establece este plan de acción puedes ser fiscalizado por la autoridad.\n"]
[]
[]
[null,"N°","TIPO","MEDIDA DE CONTROL","EVIDENCIA DE CUMPLIMIENTO","RESPONSABLE","FECHA IMPLEMENTACIÓN","EVALUACIÓN"]
[]
[null,"1.- MEDIDAS DE GESTIÓN Y ORGANIZACIÓN QUE DEBEN SER ADOPATADAS POR LA DIRECCIÓN TÉCNICA"]
[]
[null,"1.1","Obligatorio","El Director Técnico del recinto deberá designar a un profesional responsable de coordinar la planificación de medidas de prevención para COVID-19, informando al equipo de la residencia la designación de esa persona.","a) Comunicado oficial de la Dirección Técnica con la designación del profesional responsable",null,null,{"$f":"+VLOOKUP(B15,EVALUACION!$B$15:$E$1000,4,FALSE)","v":0}]
[null,"1.2","Obligatorio","Se deberá contar con un plan de de contingencias acorde a las especificaciones establecidas en la Guía práctica de manejo COVID-19 en Establecimientos de Larga Estadía para Adultos Mayores (ELEAM), abril 2020. La fiscalización de lo antes señalado estará a cargo del Ministerio de Desarrollo Social y Familia en coordinación permanente con los profesionales del Ministerio de Salud.\nLa guía práctica de manejo de COVID-19 en ELEAM, exige el abordaje de 10 elementos, cada uno con sus respectivas medidas obligatorias. Los elementos que deben ser gestionados son: 1. COMUNICACIÓN Y COORDINACIÓN DEL PLAN DE CONTINGENCIAS 2. REVISIÓN DE INFRAESTRUCURA\n3. ANTECEDENTES DE LOS RESIDENTES\n4. DISPONIBILIDAD DE ELEMENTOS DE PROTECCIÓN PERSONAL\n5. RECURSOS HUMANOS\n6. PROTOCOLO DE LIMPIEZA Y DESINFECCIÓN\n7. INGRESO Y EGRESO DEL PERSONAL\n8. AISLACIÓN\n9. MANEJO DE CASOS SOSPECHOSOS O CONFIRMADOS COVID-19\n10. MANEJO DE OTRAS SITUACIONES ESPECÍFICAS","a) Plan de contingencias acorde a las especificaciones de la Guía práctica de manejo COVID-19 en Establecimientos de Larga Estadía para Adultos Mayores (ELEAM), abril 2020",null,null,{"$f":"+VLOOKUP(B16,EVALUACION!$B$15:$E$1000,4,FALSE)","v":0}]
[null,"1.3","Obligatorio","Conforme guía de SENAMA y MINSAL, se establece que se debe contactar al encargado local de ELEAMs en SEREMI de Salud y en CESFAM correspondiente para informar el plan de contingencia (oportunidad para comunicar aspectos débiles o ausentes) y acordar sistema de comunicación en casos de COVID-19. En particular, se deberá identificar el servicio con el cual coordinarse o al que se debe concurrir en caso de requerir atención de urgencia. Se recomienda definir previamente los mecanismos de traslado.\nEn caso de tener conexión a internet envíe informe por escrito de su plan de contingencia y acuerdos de comunicación de su red (nombre encargados y números de contacto).\nFono: 800 400 035 (Orientación sobre Programas de SENAMA y contención emocional).\nFono: 600 360 77 77 (Salud Responde – MINSAL).","a) Plan de contingencias acorde a las especificaciones de la Guía práctica de manejo COVID-19 en Establecimientos de Larga Estadía para Adultos Mayores (ELEAM), abril 2020.\nb) Plan y registro de comunicaciones",null,null,{"$f":"+VLOOKUP(B17,EVALUACION!$B$15:$E$1000,4,FALSE)","v":0}]
[null,"1.4","Obligatorio","Se deberá mantener el número de contacto de los miembros del equipo de salud locales, en un lugar visible indicando el nombre y teléfono de los referentes de salud del territorio. En particular, se deberá identificar el servicio con el cual coordinarse o al que se debe concurrir en caso de requerir atención de urgencia. Se recomienda definir previamente los mecanismos de traslado. Por otra parte la Guía de SENAMA y MINSAL,, establece que se debe contactar al encargado de adulto mayor o en su defecto con la dirección del establecimiento centro de salud familiar (CESFAM) para:\n- Informar que está trabajando en plan de contingencia.\n- Coordinar que la vacunación contra la influenza y neumococica se realice dentro del establecimiento.\n- Definir en conjunto protocolo local para atención domiciliaria.\n- Coordinar con el establecimiento al que se debe concurrir en caso de requerir atención de urgencia. Se recomienda definir previamente los mecanismos de traslado.","a) Plan de contingencias acorde a las especificaciones de la Guía práctica de manejo COVID-19 en Establecimientos de Larga Estadía para Adultos Mayores (ELEAM), abril 2020.\nb) Plan y registro de comunicaciones\nc) Listado de nombre y números de contacto de equipos de salud locales",null,null,{"$f":"+VLOOKUP(B18,EVALUACION!$B$15:$E$1000,4,FALSE)","v":0}]
[null,"1.5","Obligatorio","Se debe coordinar con servicios de atención primaria para promover que la vacunación contra la influenza se realice dentro del establecimiento.\nConforme guía de SENAMA y MINSAL, es importante que se cumpla con el plan de vacunación contra la influenza implementado por el Ministerio de Salud, tanto para los trabajadores como para los residentes, así como también, mantener el registro correspondiente de dicha vacunación.","a) Plan de vacacunación del establecimiento\nb) Registros de vacunación de todo el personal y adultos mayores",null,null,{"$f":"+VLOOKUP(B19,EVALUACION!$B$15:$E$1000,4,FALSE)","v":0}]
[null,"1.6","Obligatorio","Se debe definir una persona responsable de comunicación con el personal, residentes y familiares, respecto al estatus e impacto del COVID-19 en el establecimiento.","a) Comunicado con el nombre y cargo del responsable a cargo de las comunicaciones.",null,null,{"$f":"+VLOOKUP(B20,EVALUACION!$B$15:$E$1000,4,FALSE)","v":0}]
{"$rows_left_out":56}
{"sheet":"BASE_EVAL","index":5,"n_rows":71,"n_cols":5,"rows_kept":71,"cut":false,"hidden":false,"merged":[[2,1,5,7],[0,1,1,7]]}
[null,"LISTA DE VERIFICACIÓN - SERIE COVID-19"]
[]
[null,"MEDIDAS PREVENTIVAS EN ESTABLECIMIENTOS DE ATENCIÓN DE SALUD\nFRENTE AL COVID-19"]
[]
[]
[]
[]
[null,"N°","TIPO","PREGUNTA DE EVALUACIÓN (MEDIDA SEÑALADA POR LA AUTORIDAD)","EVALUACIÓN"]
[]
[null,"1.- MEDIDAS DE GESTIÓN Y ORGANIZACIÓN QUE DEBEN SER ADOPATADAS POR LA DIRECCIÓN TÉCNICA"]
[]
[null,"1.1","Obligatorio","¿Se ha designado a un profesional responsable de coordinar la planificación de medidas de prevención para COVID-19?"]
[null,"1.2","Obligatorio","¿Se cuenta con un plan de de contingencias acorde a las especificaciones establecidas en la Guía práctica de manejo COVID-19 en Establecimientos de Larga Estadía para Adultos Mayores (ELEAM), abril 2020?"]
[null,"1.3","Obligatorio","¿Se cumple con establecer la máxima coordinación con los establecimientos de salud locales, a efectos de asegurar la atención de los residentes por parte del equipo de salud, según corresponda?"]
[null,"1.4","Obligatorio","¿Se cumple con mantener el número de contacto de los miembros del equipo de salud locales?"]
[null,"1.5","Obligatorio","¿Se cumple con coordinar con los servicios de atención primaria para promover que la vacunación contra la influenza se realice dentro del establecimiento?."]
[null,"1.6","Obligatorio","¿Se ha definido una persona responsable de comunicación con el personal, residentes y familiares, respecto al estatus e impacto del COVID-19 en el establecimiento?"]
[null,"1.7","Obligatorio","¿Se cumple con informar con señalética y otros métodos de comunicación al personal, miembros de la familia,visitantes y otras personas que ingresan a las instalaciones, sobre el estado de COVID-19 en el establecimiento y políticas de prevención?."]
[null,"1.8","Obligatorio","¿Se cumple con revisar constantemente los suministros de la residencia?"]
[null,"1.9","Obligatorio","¿Se cumple con asegurar un buen stock de los medicamentos que requieran las personas mayores y prever que no se quiebre ese stock durante al menos 30 días?."]
{"$rows_left_out":51}