{"text_format":"1","workbook":"xlsx","n_sheets":6,"sheets":["INSTRUCCIONES","DATOS","EVALUACION","INFO CENTRO","PLAN DE MEDIDAS","BBDD"],"not_rendered":{"charts":0,"images":1,"macros":1,"external_links":0,"defined_names":19,"comments":0,"pivot_tables":0},"unopened":[],"bounds":{"document_bytes":16777216,"sheet_cells":100000,"rows_first":2000,"rows_last":500,"rows_between":2000,"halvings":0,"cell_chars":16384,"cell_head_chars":4096},"cells_cut":0,"cells_raw":0,"read":"whole","date_system":"1900"}

{"sheet":"INSTRUCCIONES","index":0,"n_rows":33,"n_cols":19,"rows_kept":33,"cut":false,"hidden":false,"merged":[[8,1,16,18],[32,2,34,16],[20,2,22,16],[24,2,26,16],[28,2,30,16]]}
[null,null,null,null,null,null,null,null,null,null,null,null,null,null,null,null,null,null,"                     METODOLOGÍAS SECTORIALES"]
[]
[]
[]
[]
[]
[]
[null,null,null,null,null,null,null,null,null,null,null,null,null,null,null,null,null,null,"Fecha de actualización: 24 de septiembre de 2021."]
[null,"La siguiente lista de verificación de medidas preventivas ha sido construida a partir de lo establecido en:\n- Protocolo de limpieza y desinfección de ambientes COVID-19 \n- Protocolo de manejo de contactos de casos COVID-19 – Fase 4 \n- Circular C37 Nº1, Protocolo de referencia para correcto uso de equipo de protección personal en pacientes sospechosos o confirmados de Covid-19, 18 marzo 2020. \n- Circular C37 Nº2, Racionalización del uso de equipos de protección personal (epp) en el contexto de la atención de pacientes durante la pandemia de Covid-19, 03 abril 2020. \n- Circular C37 Nº4, Sobre algunas medidas para la protección del personal de salud en el contexto de la atención en establecimientos de salud durante la pandemia de Covid-19, 21 abril 2020. \n- Circular C37 Nº10, Recomendaciones sobre aseo y desinfección de superficies ambientales para la prevención de infecciones asociadas a la atención en salud (IAAS), 6 diciembre 2018. \n- Circular C13 Nº9, Precauciones estándares para el control de infecciones en la atención en salud y algunas consideraciones sobre aislamiento de pacientes, 13 marzo 2013. \n- Norma General Técnica Nº199, Norma técnica sobre esterilización y desinfección de alto nivel y uso de artículos médicos estériles en establecimientos de atención de salud. \n"]
[]
[]
[]
[]
[]
[]
[]
[]
[]
[null,"PASOS A SEGUIR"]
[]
{"$rows_left_out":14}
{"sheet":"DATOS","index":1,"n_rows":35,"n_cols":19,"rows_kept":35,"cut":false,"hidden":false,"merged":[[33,11,33,12],[33,14,33,18],[23,1,23,2],[23,4,23,9],[23,11,23,12],[23,14,23,17],[26,1,26,4],[26,6,26,9],[26,11,26,14],[9,1,10,18],[30,11,31,18],[31,1,31,2],[31,4,31,5],[31,7,31,8],[15,1,15,6],[15,8,15,10],[18,1,18,6],[18,8,18,10],[18,12,18,14]]}
[null,"                     METODOLOGÍAS SECTORIALES"]
[]
[]
[]
[]
[]
[null,{"$f":"+IF(COUNTA(B16,I16,B19,I19,M19,E24,L24,G27,L27)=9,\"Avanza\",\"No avanza\")","v":"No avanza"}]
[null,"ESTABLECIMIENTOS DE ATENCIÓN DE SALUD EVALUADO"]
[]
[null,"A continuación debe ingresar la información que individualiza el establecimiento de salud donde se aplica la presente pauta de evaluación. Se debe considerar que los registros marcados con asteriscos (*) son obligatorios para poder continuar."]
[]
[]
[null,"Entidad empleadora"]
[]
[null,"Razón Social*",null,null,null,null,null,null,"RUT Empresa*"]
[]
[]
[null,"Responsable de aplicación*",null,null,null,null,null,null,"Cargo*",null,null,null,"Correo electrónico*"]
[]
[]
{"$rows_left_out":16}
{"sheet":"EVALUACION","index":2,"n_rows":87,"n_cols":6,"rows_kept":87,"cut":false,"hidden":false,"merged":[[9,1,10,4]]}
[null,"                     METODOLOGÍAS SECTORIALES"]
[]
[]
[]
[]
[]
[]
[null,"LISTA DE EVALUACIÓN"]
[]
[null,"En la columna \"Evaluación\" del siguiente listado debes indicar si se cumple la medida indicada. Finalizado, debes generar el PLAN DE MEDIDAS por medio del botón ubicado al costado derecho de este texto. Considerar que las preguntas sin respuestas serán consideradas como no cumplidas."]
[]
[]
[null,"N°","TIPO","MEDIDA SEÑALADA POR LA AUTORIDAD","NORMA RELACIONADA","EVALUACIÓN"]
[null,"CERO"]
[null,"ORGANIZACIÓN Y RESPONSABILIDADES EN EL CENTRO"]
[null,"CERO"]
[null,1,"Medida obligatoria\nPASO A PASO LABORAL","Los trabajadores(as) desempeñan sus funciones, conforme se dispone por la autoridad sanitaria en la Estrategia Gradual “PASO A PASO” 2020 (cuarentena, transición, preparación, apertura inicial, apertura avanzada), respecto al lugar de procedencia del trabajador(a) y tipo de actividad que desarrolla la empresa.","Resolución Exenta N°644 de 14 de julio de 2021 del Ministerio de Salud y artículos 184 y 184 bis del Código del Trabajo."]
[null,"1.1","Medida obligatoria\nPASO A PASO LABORAL","Se cuenta, implementa y difunde el plan de ACCIONES PARA LA GESTIÓN PREVENTIVA DEL COVID-19","Paso a Paso Laboral: Etapa 2: \"Organiza y acuerda\".\nArt. 184 del Código del Trabajo."]
[null,"1.2","Medida obligatoria\nPASO A PASO LABORAL","Se constituye un EQUIPO DE TRABAJO para liderar las acciones para la gestión preventiva del COVID-19 con representatividad de trabajadores y empleadores","Paso a Paso Laboral: Etapa 2: \"Organiza y acuerda\".\nArt. 184 del Código del Trabajo."]
[null,"1.3","Medida obligatoria\nPASO A PASO LABORAL","Existe un RESPONSABLE de mantener los ELEMENTOS BÁSICOS DE HIGIENE y los EPP (elementos de protección personal) necesarios para el funcionamiento del centro, asegurando que sean accesibles a todos los trabajadores","Paso a Paso Laboral: Etapa 2: \"Organiza y acuerda\".\nArt. 184 del Código del Trabajo."]
{"$rows_left_out":68}
{"sheet":"INFO CENTRO","index":3,"n_rows":33,"n_cols":19,"rows_kept":33,"cut":false,"hidden":false,"merged":[[0,1,0,18],[1,1,3,18],[7,1,8,18],[13,1,13,6],[13,8,13,10],[16,1,16,6],[16,8,16,10],[16,12,16,14],[21,1,21,2],[21,4,21,9],[21,11,21,12],[21,14,21,17],[31,11,31,12],[31,14,31,18],[24,1,24,4],[24,6,24,9],[24,11,24,14],[28,11,29,18],[29,1,29,2],[29,4,29,5],[29,7,29,8]]}
[null,"METODOLOGÍAS SECTORIALES"]
[null,"MEDIDAS PREVENTIVAS EN CENTROS DE TRABAJO\nFRENTE AL COVID-19"]
[]
[]
[]
[null,"INFORMACIÓN DEL ESTABLECIMIENTOS DE ATENCIÓN DE SALUD EVALUADO"]
[]
[null,"A continuación se indica la información que individualiza el establecimiento de salud donde se aplico la pauta de evaluación. En la hoja \"PLAN DE MEDIDAS\" encontraras las acciones que debes implementar para abordar las brechas detectadas en la evaluación."]
[]
[]
[null,"Entidad empleadora"]
[]
[null,"Razón Social",null,null,null,null,null,null,"RUT Empresa"]
[null,{"$f":"+DATOS!$B$16","v":0},null,null,null,null,null,null,{"$f":"+DATOS!$I$16","v":0}]
[]
[null,"Responsable de aplicación",null,null,null,null,null,null,"Cargo",null,null,null,"Correo electrónico"]
[null,{"$f":"+DATOS!$B$19","v":0},null,null,null,null,null,null,{"$f":"+DATOS!$I$19","v":0},null,null,null,{"$f":"+DATOS!$M$19","v":0}]
[]
[null,"Dirección centro de trabajo"]
[]
{"$rows_left_out":14}
{"sheet":"PLAN DE MEDIDAS","index":4,"n_rows":85,"n_cols":11,"rows_kept":85,"cut":false,"hidden":false,"merged":[[1,1,3,9],[0,1,0,9],[7,1,8,9]]}
[null,"METODOLOGÍAS SECTORIALES"]
[null,"PLAN DE MEDIDAS PREVENTIVAS EN ESTABLECIMIENTOS DE ATENCIÓN DE SALUD\nFRENTE AL COVID-19"]
[]
[]
[]
[null,"PLAN DE MEDIDAS PREVENTIVAS"]
[]
[null,"Para las siguientes actividades se debe establecer RESPONSABLE y FECHA DE IMPLEMENTACIÓN, generando los registros de evidencias solicitados. Considerar que los puntos que establece este plan de medidas pueden ser fiscalizado por la autoridad."]
[]
[]
[null,"N°","TIPO","MEDIDA DE CONTROL","EVIDENCIA DE CUMPLIMIENTO","RESPONSABLE","FECHA IMPLEMENTACIÓN",null,"MATERIAL DE APOYO",null,"cruce"]
[null,"CERO",null,null,null,null,null,null,null,null,{"$f":"+VLOOKUP(B12,EVALUACION!#REF!,5,FALSE)","v":{"$error":"#REF!"}}]
[null,"ORGANIZACIÓN Y RESPONSABILIDADES EN EL CENTRO"]
[null,"CERO"]
[null,1,"Medida obligatoria\nPASO A PASO LABORAL","Se debe considerar la estrategia “PASO A PASO” que dispuso la autoridad sanitaria para generar el desconfinamiento gradual establecido por la pandemia del COVID 19.\n\nPara esto, la organización debe revisar la etapa (cuarentena, transición, preparación, apertura inicial, apertura avanzada) en que se encuentra la comuna donde se emplaza cada uno de sus centro trabajo, verificando las obligaciones y restricciones relacionada con la actividad económica desarrollada.\n\nAdemás, en función de esta estrategia, debe planificar el retorno de los trabajadores a cada centro, considerando los aforos máximo por instalación y la procedencia de cada uno de ellos, verificando que la comuna de su domicilio particular se encuentra en etapa que permite su desplazamiento. ","• Registro actualizado de domicilio particular de cada trabajador.\n• Plan de retorno por cada centro de trabajo.",null,null,"https://www.gob.cl/coronavirus/pasoapaso/","https://www.minsal.cl/conoce-el-plan-paso-a-paso/","-"]
[null,"1.1","Medida obligatoria\nPASO A PASO LABORAL","Se debe considerar la generación de un plan de ACCIONES PARA LA GESTIÓN PREVENTIVA DEL COVID-19, el cual se debe tener por contenido mínimo lo dispuesto en el programa modelo elaborado por la Intendencia de Seguridad y Salud en el Trabajo.\n\nEste plan debe ser difundido a todos los trabajadores, línea de mando, sindicatos, CPHS, contratistas y subcontratistas, dejando registro o evidencia de esta acción.","• Plan de acción para la gestión preventiva del COVID-19.\n• Registro de difusión del plan a línea de mando, sindicatos, CPHS, contratistas, etc., según proceda.",null,null,"https://coronavirus.achs.cl/docs/default-source/default-document-library/achs_plan_de_respuesta_control_y_prevencion.docx?sfvrsn=f918cbe1_2","-","-"]
[null,"1.2","Medida obligatoria\nPASO A PASO LABORAL","Se debe constituir un EQUIPO DE TRABAJO, con representatividad de trabajadores y empleadores, para gestionar todas las acciones preventivas frente al COVID-19 que debe implementar la organización. Este equipo se debe reunir a lo menos una vez por semana para:\n\n• Verificar el cumplimiento y eficacia de las medidas implementadas, dejando el registro que evidencie esas acciones.\n• Generar la retroalimentación y monitoreo de la situación en la empresa.\n• Proponer las mejoras que se requieran para tratar las desviaciones observadas, efectuando el seguimiento de las mismas.\n\nAdemás, se deberá delegar en el Comités Paritarios de Higiene y Seguridad (cuando corresponda), el monitoreo del cumplimiento de las medidas establecidas en el plan de acción para la gestión preventiva del COVID-19.","• Designación de integrantes del equipo de trabajo en el plan de acción.\n• Descripción de las funciones específicas de los integrantes.\n• Registro de reuniones semanales.",null,null,"https://coronavirus.achs.cl/docs/default-source/default-document-library/achs_plan_de_respuesta_control_y_prevencion.docx?sfvrsn=f918cbe1_2","-","-"]
[null,"1.3","Medida obligatoria\nPASO A PASO LABORAL","Se debe ASIGNAR un RESPONSABLE de asegurar el stock de los ELEMENTOS BÁSICOS DE HIGIENE y los EPP (elementos de protección personal) requeridos para el correcto funcionamiento del centro de trabajo.\nLos elementos básicos de higiene:\n• Jabón, alcohol o alcohol gel.\n• Toalla de papel para el secado de manos. \n• Contenedores de basura con tapa.\nLos elementos de protección personal:\n• Dependen de la exposición de los trabajadores del centro. Su entrega debe quedar registrada, indicando \"No compartir los elementos de protección personal, estos son de uso exclusivo para cada trabajador que lo requiere\". \n","• Registro que indique la asignación de la persona responsable en el plan de respuesta.",null,null,"-","-","-"]
[null,"CERO"]
[null,"MEDIDAS PREVENTIVAS APLICABLES AL CENTRO"]
{"$rows_left_out":66}
{"sheet":"BBDD","index":5,"n_rows":724,"n_cols":22,"rows_kept":724,"cut":false,"hidden":true,"merged":[]}
[null,"Código Región","NombreRegion","Abreviatura Región",null,null,"Tarapacá","Antofagasta","Atacama","Coquimbo","Valparaíso","Libertador_General_Bernardo_OHiggins","Maule","Biobío","La_Araucanía","Los_Lagos","Aysén_del_General_Carlos_Ibáñez_del_Campo","Magallanes_y_de_la_Antártica_Chilena","Metropolitana_de_Santiago","Los_Ríos","Arica_y_Parinacota","Ñuble"]
[null,"01","Tarapacá","TPCA",null,null,"Alto Hospicio","Antofagasta","Alto del Carmen","Andacollo","Algarrobo","Chépica","Cauquenes","Alto Biobío","Angol","Ancud","Coihaique","Antártica","Alhué","Corral","Arica","Bulnes"]
[null,"02","Antofagasta","ANTOF",null,null,"Camiña","Calama","Caldera","Canela","Cabildo","Chimbarongo","Chanco","Antuco","Carahue","Calbuco","Aisén","Cabo de Hornos","Buin","Futrono","Camarones","Chillán"]
[null,"03","Atacama","ATCMA",null,null,"Colchane","María Elena","Chañaral","Combarbalá","Calera","Codegua","Colbún","Arauco","Cholchol","Castro","Chile Chico","Laguna Blanca","Calera de Tango","La Unión","General Lagos","Chillán Viejo"]
[null,"04","Coquimbo","COQ",null,null,"Huara","Mejillones","Copiapó","Coquimbo","Calle Larga","Coinco","Constitución","Cabrero","Collipulli","Chaitén","Cisnes","Natales","Cerrillos","Lago Ranco","Putre","Cobquecura"]
[null,"05","Valparaíso","VALPO",null,null,"Iquique","Ollagüe","Diego de Almagro","Illapel","Cartagena","Coltauco","Curepto","Cañete","Cunco","Chonchi","Cochrane","Porvenir","Cerro Navia","Lanco",null,"Coelemu"]
[null,"06","Libertador General Bernardo OHiggins","LGBO",null,null,"Pica","San Pedro de Atacama","Freirina","La Higuera","Casablanca","Doñihue","Curicó","Chiguayante","Curacautín","Cochamó","Guaitecas","Primavera","Colina","Los Lagos",null,"Coihueco"]
[null,"07","Maule","MAULE",null,null,"Pozo Almonte","Sierra Gorda","Huasco","La Serena","Catemu","Graneros","Empedrado","Concepción","Curarrehue","Curaco de Vélez","Lago Verde","Punta Arenas","Conchalí","Máfil",null,"El Carmen"]
[null,"08","Biobío","BBIO",null,null,null,"Taltal","Tierra Amarilla","Los Vilos","Concón","La Estrella","Hualañé","Contulmo","Ercilla","Dalcahue","O'Higgins","Río Verde","Curacaví","Mariquina",null,"Ninhue"]
[null,"09","La Araucanía","ARAUC",null,null,null,"Tocopilla","Vallenar","Monte Patria","El Quisco","Las Cabras","Licantén","Coronel","Freire","Fresia","Río Ibáñez","San Gregorio","El Bosque","Paillaco",null,"Ñiquén"]
[null,"10","Los Lagos","LAGOS",null,null,null,null,null,"Ovalle","El Tabo","Litueche","Linares","Curanilahue","Galvarino","Frutillar","Tortel","Timaukel","El Monte","Panguipulli",null,"Pemuco"]
[null,"11","Aysén del General Carlos Ibáñez del Campo","AYSEN",null,null,null,null,null,"Paiguano","Hijuelas","Lolol","Longaví","Florida","Gorbea","Futaleufú",null,"Torres del Paine","Estación Central","Río Bueno",null,"Pinto"]
[null,"12","Magallanes y de la Antártica Chilena","MAG",null,null,null,null,null,"Punitaqui","Isla de Pascua","Machalí","Maule","Hualpén","Lautaro","Hualaihué",null,null,"Huechuraba","Valdivia",null,"Portezuelo"]
[null,"13","Metropolitana de Santiago","RM",null,null,null,null,null,"Río Hurtado","Juan Fernández","Malloa","Molina","Hualqui","Loncoche","Llanquihue",null,null,"Independencia",null,null,"Quillón"]
[null,"14","Los Ríos","RIOS",null,null,null,null,null,"Salamanca","La Cruz","Marchihue","Parral","Laja","Lonquimay","Los Muermos",null,null,"Isla de Maipo",null,null,"Quirihue"]
[null,"15","Arica y Parinacota","AyP",null,null,null,null,null,"Vicuña","La Ligua","Mostazal","Pelarco","Lebu","Los Sauces","Maullín",null,null,"La Cisterna",null,null,"Ranquil"]
[null,"16","Ñuble","NUBLE",null,null,null,null,null,null,"Limache","Nancagua","Pelluhue","Los Alamos","Lumaco","Osorno",null,null,"La Florida",null,null,"San Carlos"]
[null,null,null,null,null,null,null,null,null,null,"Llaillay","Navidad","Pencahue","Los Angeles","Melipeuco","Palena",null,null,"La Granja",null,null,"San Fabián"]
[null,null,null,null,null,null,null,null,null,null,"Los Andes","Olivar","Rauco","Lota","Nueva Imperial","Puerto Montt",null,null,"La Pintana",null,null,"San Ignacio"]
[null,"Resultado","Tipo de calle",null,null,null,null,null,null,null,"Nogales","Palmilla","Retiro","Mulchén","Padre Las Casas","Puerto Octay",null,null,"La Reina",null,null,"San Nicolás"]
{"$rows_left_out":704}