{"text_format":"1","workbook":"xlsx","n_sheets":5,"sheets":["INSTRUCCIONES","DATOS","EVALUACION","INFO CENTRO","PLAN DE MEDIDAS"],"not_rendered":{"charts":0,"images":1,"macros":1,"external_links":0,"defined_names":4,"comments":2,"pivot_tables":0},"unopened":[],"bounds":{"document_bytes":16777216,"sheet_cells":100000,"rows_first":2000,"rows_last":500,"rows_between":2000,"halvings":0,"cell_chars":16384,"cell_head_chars":4096},"cells_cut":0,"cells_raw":0,"read":"whole","date_system":"1900"}

{"sheet":"INSTRUCCIONES","index":0,"n_rows":34,"n_cols":18,"rows_kept":34,"cut":false,"hidden":false,"merged":[[33,1,34,17],[0,1,4,17],[18,1,18,10],[9,1,16,17],[20,1,21,17],[23,1,24,17],[26,1,28,17],[30,1,31,17]]}
[null,"    INSTRUCTIVO DE USO"]
[]
[]
[]
[]
[]
[]
[]
[null,null,null,null,null,null,null,null,null,null,null,null,null,null,null,null,null,"Fecha de actualización del documento: 23 de marzo de 2021."]
[null,"La siguiente lista de verificación de medidas preventivas ha sido construida a partir de lo establecido en: \n\n(a) Recomendaciones de actuación en los lugares de trabajo en el contexto COVID-19 (excluidos los establecimientos de atención de salud), de fecha 07 de abril de 2020, MINSAL,  ORD/B1 N°1086. \n(b) Protocolo de manejo y prevención ante COVID-19 en restaurantes, cafés y otros establecimientos análogos, publicado el 08 de junio de 2020 por el Ministerio de Economía, Fomento y Turismo.\n(c) Protocolo general de manejo y prevención ante covid-19 en el sector turismo. Protocolo de manejo y prevención ante COVID-19 en restaurantes, cafés y otros establecimientos análogos, publicado el 08 de junio de 2020 por el Ministerio de Economía, Fomento y Turismo.\n(c) Resolución Exenta N°282 de fecha 16 de abril de 2020 de MINSAL, la cual dispone uso obligatorio de mascarillas en lugares y circunstancias que indica.\n(e) Buenas prácticas de la Industria en materia de manejo de crisis. "]
[]
[]
[]
[]
[]
[]
[]
[]
[null,"Pasos a seguir"]
[]
{"$rows_left_out":15}
{"sheet":"DATOS","index":1,"n_rows":31,"n_cols":15,"rows_kept":31,"cut":false,"hidden":false,"merged":[[2,1,5,18],[0,1,1,18],[30,9,30,10],[14,14,14,15],[14,11,14,12],[14,16,14,17],[11,1,11,10],[14,1,14,2],[28,1,28,2],[17,1,17,10],[20,1,20,2],[22,1,22,2],[25,1,25,10],[20,3,20,4],[20,6,20,7],[14,9,14,10],[14,3,14,7],[28,3,28,7],[22,3,22,7],[22,9,22,10],[28,9,28,10],[20,14,20,15],[20,16,20,17],[22,16,22,17],[28,16,28,17],[30,11,30,12],[28,14,28,15],[30,14,30,15],[22,14,22,15],[22,11,22,12],[30,16,30,17],[20,8,20,12],[28,11,28,12]]}
[null,"LISTA DE VERIFICACIÓN - SERIE COVID-19"]
[]
[null,"MEDIDAS PREVENTIVAS EN CENTROS DE TRABAJO\nFRENTE AL COVID-19"]
[]
[]
[]
[]
[]
[]
[null,"INFORMACIÓN DEL CENTRO DE TRABAJO EVALUADO"]
[]
[null,"Entidad empleadora"]
[]
[]
[null,"RAZÓN SOCIAL",null,null,null,null,null,null,null,"RUT",null,null,null,null,"CIIU PRINCIPAL"]
[]
[]
[null,"Dirección del centro"]
[]
[]
{"$rows_left_out":12}
{"sheet":"EVALUACION","index":2,"n_rows":250,"n_cols":6,"rows_kept":250,"cut":false,"hidden":false,"merged":[[0,1,1,7],[2,1,5,7],[42,4,42,5],[58,4,58,5],[64,4,64,5]]}
[null,"LISTA DE VERIFICACIÓN - SERIE COVID-19"]
[]
[null,"MEDIDAS PREVENTIVAS EN CENTROS DE TRABAJO\nFRENTE AL COVID-19"]
[]
[]
[]
[]
[]
[]
[]
[null,"N°","TIPO","PREGUNTA DE EVALUACIÓN (MEDIDA SEÑALADA POR LA AUTORIDAD)","NORMA LEGAL RELACIONADA","EVALUACIÓN"]
[null,"CERO"]
[null,"1.- ORGANIZACIÓN Y RESPONSABILIDADES EN EL CENTRO"]
[null,"CERO"]
[null,1,"Medida obligatoria\nPASO A PASO LABORAL","Los trabajadores(as) desempeñan sus funciones, conforme se dispone por la autoridad sanitaria en la Estrategia Gradual “PASO A PASO” 15 de enero de 2021 (cuarentena, transición, preparación, apertura inicial, apertura avanzada), respecto al lugar de procedencia del trabajador(a) y tipo de actividad que desarrolla la empresa.","Resolución Exenta N°43 de 15 de enero de 2021 del Ministerio de Salud y artículos 184 y 184 bis del Código del Trabajo.\nFormulario único de fiscalización de medidas preventivas para el COVID-19 en lugares de trabajo."]
[null,"1.1","Medida obligatoria\nPASO A PASO LABORAL","Se cuenta, implementa y difunde el plan de ACCIONES PARA LA GESTIÓN PREVENTIVA DEL COVID-19","Paso a Paso Laboral: Etapa 2: \"Organiza y acuerda\".\nArt. 184 del Código del Trabajo."]
[null,"1.2","Medida obligatoria\nPASO A PASO LABORAL","Se constituye un EQUIPO DE TRABAJO para liderar las acciones para la gestión preventiva del COVID-19 con representatividad de trabajadores y empleadores","Paso a Paso Laboral: Etapa 2: \"Organiza y acuerda\".\nArt. 184 del Código del Trabajo."]
[null,"1.3","Medida obligatoria\nPASO A PASO LABORAL","Existe un RESPONSABLE de mantener los ELEMENTOS BÁSICOS DE HIGIENE y los EPP (elementos de protección personal) necesarios para el funcionamiento del centro, asegurando que sean accesibles a todos los trabajadores","Paso a Paso Laboral: Etapa 2: \"Organiza y acuerda\".\nArt. 184 del Código del Trabajo."]
[null,"CERO"]
[null,"2.- MEDIDAS PREVENTIVAS APLICABLES AL CENTRO"]
{"$rows_left_out":231}
{"sheet":"INFO CENTRO","index":3,"n_rows":26,"n_cols":16,"rows_kept":26,"cut":false,"hidden":false,"merged":[[14,15,14,17],[16,15,16,17],[0,1,1,18],[2,1,5,18],[12,1,12,2],[14,1,14,2],[16,1,16,2],[12,12,12,17],[14,3,14,8],[16,3,16,8],[14,11,14,13],[12,10,12,11],[12,3,12,8],[16,11,16,13],[23,2,23,4],[23,6,23,8],[25,2,25,4],[25,6,25,8],[21,3,21,8],[21,1,21,2]]}
[null,"LISTA DE VERIFICACIÓN - SERIE COVID-19"]
[]
[null,"MEDIDAS PREVENTIVAS EN CENTROS DE TRABAJO\nFRENTE AL COVID-19"]
[]
[]
[]
[]
[null,"INFORMACIÓN DEL CENTRO DE TRABAJO EVALUADO"]
[]
[null,"Entidad empleadora",null,null,null,null,null,null,null,null,"Dirección del centro"]
[]
[]
[null,"RAZÓN SOCIAL",null,{"$f":"+IF(DATOS!D15=\"\",\"SIN INFORMACIÓN\",DATOS!D15)","v":"SIN INFORMACIÓN"},null,null,null,null,null,null,"DIRECCIÓN",null,{"$f":"+IF(DATOS!I21=\"\",\"SIN INFORMACIÓN\",DATOS!I21)","v":"SIN INFORMACIÓN"}]
[]
[null,"RUT",null,{"$f":"+IF(DATOS!L15=\"\",\"SIN INFORMACIÓN\",DATOS!L15)","v":"SIN INFORMACIÓN"},null,null,null,null,null,null,"NUMERO",{"$f":"+IF(DATOS!Q21=\"\",\"SIN INFORMACIÓN\",DATOS!Q21)","v":"SIN INFORMACIÓN"},null,null,"LOCALIDAD",{"$f":"+IF(DATOS!D23=\"\",\"SIN INFORMACIÓN\",DATOS!D23)","v":"SIN INFORMACIÓN"}]
[]
[null,"CIIU PRINCIPAL",null,{"$f":"+IF(DATOS!Q15=\"\",\"SIN INFORMACIÓN\",DATOS!Q15)","v":"SIN INFORMACIÓN"},null,null,null,null,null,null,"COMUNA",{"$f":"+IF(DATOS!L23=\"\",\"SIN INFORMACIÓN\",DATOS!L23)","v":"SIN INFORMACIÓN"},null,null,"REGIÓN",{"$f":"+IF(DATOS!Q23=\"\",\"SIN INFORMACIÓN\",DATOS!Q23)","v":"SIN INFORMACIÓN"}]
[]
[null,"Responsable de aplicación"]
[]
{"$rows_left_out":7}
{"sheet":"PLAN DE MEDIDAS","index":4,"n_rows":248,"n_cols":12,"rows_kept":248,"cut":false,"hidden":false,"merged":[[2,1,5,9],[0,1,1,9],[7,1,8,9],[6,1,6,9],[10,7,10,9]]}
[null,"LISTA DE VERIFICACIÓN - SERIE COVID-19"]
[]
[null,"PLAN DE MEDIDAS PREVENTIVAS EN CENTROS DE TRABAJO\nFRENTE AL COVID-19"]
[]
[]
[]
[]
[null,"SOBRE EL PLAN DE MEDIDAS:\nPara las siguientes actividades se debe establecer RESPONSABLE y FECHA DE IMPLEMENTACIÓN, generando los registros de evidencias solicitados. Considerar que los puntos que establece este plan de acción puede ser fiscalizado por la autoridad."]
[]
[]
[null,"N°","TIPO","MEDIDA DE CONTROL","EVIDENCIA DE CUMPLIMIENTO","RESPONSABLE","FECHA IMPLEMENTACIÓN","MATERIAL DE APOYO",null,null,"EVALUACIÓN"]
[null,"CERO",null,null,null,null,null,null,null,null,{"$f":"+VLOOKUP(B12,EVALUACION!$B$12:$F$1000,5,FALSE)","v":0}]
[null,"1.- ORGANIZACIÓN Y RESPONSABILIDADES EN EL CENTRO",null,null,null,null,null,null,null,null,{"$f":"+VLOOKUP(B13,EVALUACION!$B$12:$F$1000,5,FALSE)","v":0}]
[null,"CERO",null,null,null,null,null,null,null,null,{"$f":"+VLOOKUP(B14,EVALUACION!$B$12:$F$1000,5,FALSE)","v":0}]
[null,1,"Medida obligatoria\nPASO A PASO LABORAL","Se debe considerar la estrategia “PASO A PASO” que dispuso la autoridad sanitaria para generar el desconfinamiento gradual establecido por la pandemia del COVID 19.\n\nPara esto, la organización debe revisar la etapa (cuarentena, transición, preparación, apertura inicial, apertura avanzada) en que se encuentra la comuna donde se emplaza cada uno de sus centro de trabajo, verificando las obligaciones y restricciones relacionadas con la actividad económica desarrollada.\n\nAdemás, en función de esta estrategia, se debe planificar el retorno de los trabajadores a cada centro, considerando los aforos máximos por instalación y la procedencia de cada uno de ellos, verificando que la comuna de su domicilio particular se encuentra en etapa que permite su desplazamiento. \nConsideración: \nEl nuevo documento sobre la nueva estrategia gradual paso a paso 2021, establece que en el Paso 1 - Cuarentena, respecto de la obtención de Permisos Únicos Colectivos (PUC): \"Las empresas deberán informar al Comité Paritario, cuando existiere, el listado de personas que accederán al PUC\"","• Registro actualizado de domicilio particular de cada trabajador.\n• Plan de retorno por cada centro de trabajo.",null,null,"https://www.gob.cl/coronavirus/pasoapaso/","https://www.minsal.cl/conoce-el-plan-paso-a-paso/"," ",{"$f":"+VLOOKUP(B15,EVALUACION!$B$12:$F$1000,5,FALSE)","v":0}," "]
[null,"1.1","Medida obligatoria\nPASO A PASO LABORAL","Se debe considerar la generación de un plan de ACCIONES PARA LA GESTIÓN PREVENTIVA DEL COVID-19, el cual se debe tener por contenido mínimo lo dispuesto en el programa modelo elaborado por la Intendencia de Seguridad y Salud en el Trabajo.\n\nEste plan debe ser difundido a todos los trabajadores, línea de mando, sindicatos, CPHS, contratistas y subcontratistas, dejando registro o evidencia de esta acción.","• Plan de acción para la gestión preventiva del COVID-19.\n• Registro de difusión del plan a línea de mando, sindicatos, CPHS, contratistas, etc., según proceda.",null,null,"https://coronavirus.achs.cl/docs/default-source/default-document-library/achs_plan_de_respuesta_control_y_prevencion.docx?sfvrsn=f918cbe1_2"," "," ",{"$f":"+VLOOKUP(B16,EVALUACION!$B$12:$F$1000,5,FALSE)","v":0}," "]
[null,"1.2","Medida obligatoria\nPASO A PASO LABORAL","Se debe constituir un EQUIPO DE TRABAJO, con representatividad de trabajadores y empleadores, para gestionar todas las acciones preventivas frente al COVID-19 que debe implementar la organización. Este equipo se debe reunir a lo menos una vez por semana para:\n\n• Verificar el cumplimiento y eficacia de las medidas implementadas, dejando el registro que evidencie esas acciones.\n• Generar la retroalimentación y monitoreo de la situación en la empresa.\n• Proponer las mejoras que se requieran para tratar las desviaciones observadas, efectuando el seguimiento de las mismas.\n\nAdemás, se deberá delegar en el Comités Paritarios de Higiene y Seguridad (cuando corresponda), el monitoreo del cumplimiento de las medidas establecidas en el plan de acción para la gestión preventiva del COVID-19.","• Designación de integrantes del equipo de trabajo en el plan de acción.\n• Descripción de las funciones específicas de los integrantes.\n• Registro de reuniones semanales.",null,null,"https://coronavirus.achs.cl/docs/default-source/default-document-library/achs_plan_de_respuesta_control_y_prevencion.docx?sfvrsn=f918cbe1_2"," "," ",{"$f":"+VLOOKUP(B17,EVALUACION!$B$12:$F$1000,5,FALSE)","v":0}," "]
[null,"1.3","Medida obligatoria\nPASO A PASO LABORAL","Se debe ASIGNAR un RESPONSABLE de asegurar el stock de los ELEMENTOS BÁSICOS DE HIGIENE y los EPP (elementos de protección personal) requeridos para el correcto funcionamiento del centro de trabajo.\nLos elementos básicos de higiene:\n• Jabón, alcohol o alcohol gel.\n• Toalla de papel para el secado de manos. \n• Contenedores de basura con tapa.\nLos elementos de protección personal:\n• Dependen de la exposición de los trabajadores del centro. Su entrega debe quedar registrada, indicando \"No compartir los elementos de protección personal, estos son de uso exclusivo para cada trabajador que lo requiere\". \n","• Registro que indique la asignación de la persona responsable en el plan de respuesta.",null,null," "," "," ",{"$f":"+VLOOKUP(B18,EVALUACION!$B$12:$F$1000,5,FALSE)","v":0}," "]
[null,"CERO",null,null,null,null,null,null,null,null,{"$f":"+VLOOKUP(B19,EVALUACION!$B$12:$F$1000,5,FALSE)","v":0}," "]
[null,"2.- MEDIDAS PREVENTIVAS APLICABLES AL CENTRO",null,null,null,null,null,null,null,null,{"$f":"+VLOOKUP(B20,EVALUACION!$B$12:$F$1000,5,FALSE)","v":0}," "]
{"$rows_left_out":228}